Target
Endothelin receptor type B
Ligand
BDBM50089731
Substrate
Meas. Tech.
ChEBML_64043
IC50
12000±n/a nM
Citation
 Zhang, JDidierlaurent, SFortin, MLefrançois, DUridat, EVevert, JP Nonpeptide endothelin antagonists: from lower affinity pyrazol-5-ols to higher affinity pyrazole-5-carboxylic acids. Bioorg Med Chem Lett 10:1351-5 (2000)  
Target
Name:
Endothelin receptor type B
Synonyms:
EDNRB_RAT ET-B Endothelin receptor | Endothelin receptor non-selective type
Type:
Enzyme Catalytic Domain
Mol. Mass.:
49483.43
Organism:
RAT
Description:
ENDOTHELIN B EDNRB RAT::P21451
Residue:
442
  
Inhibitor
Name:
BDBM50089731
Synonyms:
CHEMBL3144733 | [2-(4-Benzo[1,3]dioxol-5-ylmethyl-5-hydroxy-3-trifluoromethyl-pyrazol-1-ylmethyl)-5-methoxy-phenoxy]-acetic acid
Type:
Small organic molecule
Emp. Form.:
C22H19F3N2O7
Mol. Mass.:
480.3907
SMILES:
COc1ccc(Cn2[nH]c(c(Cc3ccc4OCOc4c3)c2=O)C(F)(F)F)c(OCC(O)=O)c1
: