Target
Endothelin-1 receptor
Ligand
BDBM50089729
Substrate
Meas. Tech.
ChEBML_63354
IC50
1300±n/a nM
Citation
 Zhang, JDidierlaurent, SFortin, MLefrançois, DUridat, EVevert, JP Nonpeptide endothelin antagonists: from lower affinity pyrazol-5-ols to higher affinity pyrazole-5-carboxylic acids. Bioorg Med Chem Lett 10:1351-5 (2000)  
Target
Name:
Endothelin-1 receptor
Synonyms:
EDNRA_RAT Ednra Endothelin-1 receptor
Type:
Enzyme Catalytic Domain
Mol. Mass.:
48256.91
Organism:
RAT
Description:
ENDOTHELIN A EDNRA RAT::P26684
Residue:
426
  
Inhibitor
Name:
BDBM50089729
Synonyms:
4-(7-Chloro-benzo[1,3]dioxol-5-ylmethyl)-2-(3-methoxy-benzyl)-5-trifluoromethyl-2H-pyrazol-3-ol | CHEMBL3144735
Type:
Small organic molecule
Emp. Form.:
C20H16ClF3N2O4
Mol. Mass.:
440.8
SMILES:
COc1cccc(Cn2[nH]c(c(Cc3cc4OCOc4c(Cl)c3)c2=O)C(F)(F)F)c1
: