Target
Endothelin receptor type B
Ligand
BDBM50089720
Substrate
Meas. Tech.
ChEBML_64043
IC50
2200±n/a nM
Citation
 Zhang, JDidierlaurent, SFortin, MLefrançois, DUridat, EVevert, JP Nonpeptide endothelin antagonists: from lower affinity pyrazol-5-ols to higher affinity pyrazole-5-carboxylic acids. Bioorg Med Chem Lett 10:1351-5 (2000)  
Target
Name:
Endothelin receptor type B
Synonyms:
EDNRB_RAT ET-B Endothelin receptor | Endothelin receptor non-selective type
Type:
Enzyme Catalytic Domain
Mol. Mass.:
49483.43
Organism:
RAT
Description:
ENDOTHELIN B EDNRB RAT::P21451
Residue:
442
  
Inhibitor
Name:
BDBM50089720
Synonyms:
CHEMBL281677 | [4-Benzo[1,3]dioxol-5-ylmethyl-2-(3-methoxy-benzyl)-5-trifluoromethyl-2H-pyrazol-3-yloxy]-acetic acid
Type:
Small organic molecule
Emp. Form.:
C22H19F3N2O6
Mol. Mass.:
464.3913
SMILES:
COc1cccc(Cn2nc(c(Cc3ccc4OCOc4c3)c2OCC(O)=O)C(F)(F)F)c1
: