Target
Endothelin-1 receptor
Ligand
BDBM50089725
Substrate
Meas. Tech.
ChEBML_63354
IC50
3500±n/a nM
Citation
 Zhang, JDidierlaurent, SFortin, MLefrançois, DUridat, EVevert, JP Nonpeptide endothelin antagonists: from lower affinity pyrazol-5-ols to higher affinity pyrazole-5-carboxylic acids. Bioorg Med Chem Lett 10:1351-5 (2000)  
Target
Name:
Endothelin-1 receptor
Synonyms:
EDNRA_RAT Ednra Endothelin-1 receptor
Type:
Enzyme Catalytic Domain
Mol. Mass.:
48256.91
Organism:
RAT
Description:
ENDOTHELIN A EDNRA RAT::P26684
Residue:
426
  
Inhibitor
Name:
BDBM50089725
Synonyms:
CHEMBL3144800 | [3-(4-Benzo[1,3]dioxol-5-ylmethyl-5-hydroxy-3-trifluoromethyl-pyrazol-1-ylmethyl)-phenoxy]-acetic acid
Type:
Small organic molecule
Emp. Form.:
C21H17F3N2O6
Mol. Mass.:
450.3647
SMILES:
OC(=O)COc1cccc(Cn2[nH]c(c(Cc3ccc4OCOc4c3)c2=O)C(F)(F)F)c1
: