Target
Endothelin receptor type B
Ligand
BDBM50089736
Substrate
Meas. Tech.
ChEBML_64043
IC50
1000±n/a nM
Citation
 Zhang, JDidierlaurent, SFortin, MLefrançois, DUridat, EVevert, JP Nonpeptide endothelin antagonists: from lower affinity pyrazol-5-ols to higher affinity pyrazole-5-carboxylic acids. Bioorg Med Chem Lett 10:1351-5 (2000)  
Target
Name:
Endothelin receptor type B
Synonyms:
EDNRB_RAT ET-B Endothelin receptor | Endothelin receptor non-selective type
Type:
Enzyme Catalytic Domain
Mol. Mass.:
49483.43
Organism:
RAT
Description:
ENDOTHELIN B EDNRB RAT::P21451
Residue:
442
  
Inhibitor
Name:
BDBM50089736
Synonyms:
4-Benzo[1,3]dioxol-5-ylmethyl-5-heptafluoropropyl-2-(3-methoxy-benzyl)-2H-pyrazol-3-ol | CHEMBL3144607
Type:
Small organic molecule
Emp. Form.:
C22H17F7N2O4
Mol. Mass.:
506.3702
SMILES:
COc1cccc(Cn2[nH]c(c(Cc3ccc4OCOc4c3)c2=O)C(F)(F)C(F)(F)C(F)(F)F)c1
: