Target
Relaxin-3 receptor 2
Ligand
BDBM50534446
Substrate
Meas. Tech.
ChEMBL_1929027 (CHEMBL4432203)
EC50
2754±n/a nM
Citation
 Hojo, KHossain, MATailhades, JShabanpoor, FWong, LLOng-Pålsson, EEKastman, HEMa, SGundlach, ALRosengren, KJWade, JDBathgate, RA Development of a Single-Chain Peptide Agonist of the Relaxin-3 Receptor Using Hydrocarbon Stapling. J Med Chem 59:7445-56 (2016)  
Target
Name:
Relaxin-3 receptor 2
Synonyms:
G-protein coupled receptor 100 GPCR142 Insulin-like peptide INSL5 receptor RLN3 receptor 2 RXFP4 | Relaxin family peptide receptor 4
Type:
PROTEIN
Mol. Mass.:
41161.14
Organism:
Homo sapiens (Human)
Description:
ChEMBL_1456194
Residue:
374
  
Inhibitor
Name:
BDBM50534446
Synonyms:
CHEMBL4586048
Type:
Small organic molecule
Emp. Form.:
C110H173N33O26
Mol. Mass.:
2373.7561
SMILES:
CC[C@H](C)[C@H](NC(=O)[C@H](Cc1ccccc1)NC(=O)[C@H](CCC(O)=O)NC(=O)[C@H](CCCNC(N)=N)NC(=O)CNC(=O)[C@H](CO)NC(=O)[C@H](CC(C)C)NC(=O)[C@@H](N)CCCNC(N)=N)C(=O)N[C@@H](CCCNC(N)=N)C(=O)N[C@@]1(C)CCC\C=C/CCC[C@](C)(NC(=O)[C@H](Cc2ccccc2)NC(=O)[C@@H](NC(=O)[C@@H](NC1=O)C(C)C)[C@@H](C)CC)C(=O)N[C@@H](CO)C(=O)NCC(=O)NCC(=O)N[C@@H](CO)C(=O)N[C@@H](CCCNC(N)=N)C(=O)N[C@@H](Cc1c[nH]c2ccccc12)C(O)=O
: