Target
Relaxin-3 receptor 2
Ligand
BDBM50534447
Substrate
Meas. Tech.
ChEMBL_1929027 (CHEMBL4432203)
EC50
3715±n/a nM
Citation
 Hojo, KHossain, MATailhades, JShabanpoor, FWong, LLOng-Pålsson, EEKastman, HEMa, SGundlach, ALRosengren, KJWade, JDBathgate, RA Development of a Single-Chain Peptide Agonist of the Relaxin-3 Receptor Using Hydrocarbon Stapling. J Med Chem 59:7445-56 (2016)  
Target
Name:
Relaxin-3 receptor 2
Synonyms:
G-protein coupled receptor 100 GPCR142 Insulin-like peptide INSL5 receptor RLN3 receptor 2 RXFP4 | Relaxin family peptide receptor 4
Type:
PROTEIN
Mol. Mass.:
41161.14
Organism:
Homo sapiens (Human)
Description:
ChEMBL_1456194
Residue:
374
  
Inhibitor
Name:
BDBM50534447
Synonyms:
CHEMBL4582266
Type:
Small organic molecule
Emp. Form.:
C93H142N28O24S2
Mol. Mass.:
2100.426
SMILES:
CC[C@H](C)[C@H](NC(=O)[C@@H](NC(=O)[C@@H]1CCSSCC[C@H](NC(=O)[C@H](CCCNC(N)=N)NC(=O)CNC(=O)[C@H](CO)NC(C)=O)C(=O)N[C@@H](Cc2ccccc2)C(=O)N[C@@H]([C@@H](C)CC)C(=O)N[C@@H](CCCNC(N)=N)C(=O)N1)C(C)C)C(=O)N[C@@H](Cc1ccccc1)C(=O)N[C@@H]([C@@H](C)O)C(=O)N[C@@H](CO)C(=O)NCC(=O)NCC(=O)N[C@@H](CO)C(=O)N[C@@H](CCCNC(N)=N)C(=O)N[C@@H](Cc1c[nH]c2ccccc12)C(O)=O
: