Target
Cyclin-dependent kinase 14
Ligand
BDBM50535534
Substrate
Meas. Tech.
ChEMBL_1930927 (CHEMBL4434178)
IC50
>1000±n/a nM
Citation
 Ferguson, FMDoctor, ZMFicarro, SBMarto, JAKim, NDSim, TGray, NS Synthesis and structure activity relationships of a series of 4-amino-1H-pyrazoles as covalent inhibitors of CDK14. Bioorg Med Chem Lett 29:1985-1993 (2019)  
Target
Name:
Cyclin-dependent kinase 14
Synonyms:
CDK14 KIAA0834 Serine/threonine-protein kinase PFTAIRE-1
Type:
PROTEIN
Mol. Mass.:
53075.39
Organism:
Homo sapiens (Human)
Description:
ChEMBL_774550
Residue:
469
  
Inhibitor
Name:
BDBM50535534
Synonyms:
CHEMBL4456492
Type:
Small organic molecule
Emp. Form.:
C27H27Cl2F3N6O7S
Mol. Mass.:
707.505
SMILES:
OC(=O)C(F)(F)F.CCC(=O)Nc1cccc(c1)S(=O)(=O)N1CCC(CC1)NC(=O)c1n[nH]cc1NC(=O)c1c(Cl)cccc1Cl
: