Target
Caspase-1
Ligand
BDBM50091568
Substrate
Meas. Tech.
ChEMBL_46496 (CHEMBL659499)
IC50
46±n/a nM
Citation
 Talanian, RVBrady, KDCryns, VL Caspases as targets for anti-inflammatory and anti-apoptotic drug discovery. J Med Chem 43:3351-71 (2000)  
Target
Name:
Caspase-1
Synonyms:
CASP1 Caspase ICE IL1BCE Interleukin-1 beta-converting enzyme
Type:
Enzyme
Mol. Mass.:
45154.13
Organism:
Homo sapiens (Human)
Description:
P29466
Residue:
404
  
Inhibitor
Name:
BDBM50091568
Synonyms:
3-(2-{5-[(Naphthalene-1-carbonyl)-amino]-6-oxo-6H-pyrimidin-1-yl}-hexanoylamino)-4-oxo-5-phenoxy-pentanoic acid | CHEMBL324470
Type:
Small organic molecule
Emp. Form.:
C32H32N4O7
Mol. Mass.:
584.6191
SMILES:
CCCCC(C(=O)N[C@@H](CC(O)=O)C(=O)COc1ccccc1)n1cncc(NC(=O)c2cccc3ccccc23)c1=O
: