Target
Caspase-1
Ligand
BDBM50091581
Substrate
Meas. Tech.
ChEMBL_46496 (CHEMBL659499)
IC50
0.11±n/a nM
Citation
 Talanian, RVBrady, KDCryns, VL Caspases as targets for anti-inflammatory and anti-apoptotic drug discovery. J Med Chem 43:3351-71 (2000)  
Target
Name:
Caspase-1
Synonyms:
CASP1 Caspase ICE IL1BCE Interleukin-1 beta-converting enzyme
Type:
Enzyme
Mol. Mass.:
45154.13
Organism:
Homo sapiens (Human)
Description:
P29466
Residue:
404
  
Inhibitor
Name:
BDBM50091581
Synonyms:
3-(2-{2-[2-Acetylamino-3-(4-hydroxy-phenyl)-propionylamino]-4-carboxy-butyrylamino}-3-methyl-butyrylamino)-5-(7,7-dihydroxy-2-oxo-bicyclo[2.2.1]hept-1-ylmethanesulfonylamino)-4-oxo-pentanoic acid | CHEMBL267338
Type:
Small organic molecule
Emp. Form.:
C34H47N5O15S
Mol. Mass.:
797.826
SMILES:
CC(C)[C@H](NC(=O)[C@H](CCC(O)=O)NC(=O)[C@H](Cc1ccc(O)cc1)NC(C)=O)C(=O)NC(CC(O)=O)C(=O)CNS(=O)(=O)CC12CCC(CC1=O)C2(O)O
: