Target
Caspase-1
Ligand
BDBM50091587
Substrate
Meas. Tech.
ChEMBL_46498 (CHEMBL659501)
Ki
240±n/a nM
Citation
 Talanian, RVBrady, KDCryns, VL Caspases as targets for anti-inflammatory and anti-apoptotic drug discovery. J Med Chem 43:3351-71 (2000)  
Target
Name:
Caspase-1
Synonyms:
CASP1 Caspase ICE IL1BCE Interleukin-1 beta-converting enzyme
Type:
Enzyme
Mol. Mass.:
45154.13
Organism:
Homo sapiens (Human)
Description:
P29466
Residue:
404
  
Inhibitor
Name:
BDBM50091587
Synonyms:
3-[2-(2-Benzyloxycarbonylamino-3-methyl-butyrylamino)-propionylamino]-4-oxo-4-(5-phenyl-oxazol-2-yl)-butyric acid | CHEMBL115620
Type:
Small organic molecule
Emp. Form.:
C29H32N4O8
Mol. Mass.:
564.5864
SMILES:
CC(C)[C@H](NC(=O)OCc1ccccc1)C(=O)N[C@@H](C)C(=O)N[C@@H](CC(O)=O)C(=O)c1ncc(o1)-c1ccccc1
: