Target
P2X purinoceptor 7
Ligand
BDBM50536370
Substrate
Meas. Tech.
ChEMBL_1933657 (CHEMBL4479309)
IC50
0.490000±n/a nM
Citation
 Park, JHWilliams, DRLee, JHLee, SDLee, JHKo, HLee, GEKim, SLee, JMAbdelrahman, AMüller, CEJung, DWKim, YC Potent Suppressive Effects of 1-Piperidinylimidazole Based Novel P2X7 Receptor Antagonists on Cancer Cell Migration and Invasion. J Med Chem 59:7410-30 (2016)  
Target
Name:
P2X purinoceptor 7
Synonyms:
ATP receptor P2RX7_HUMAN P2X purinoceptor 7 (P2X7) P2Z receptor | Purinergic receptor
Type:
Protein
Mol. Mass.:
68602.85
Organism:
Homo sapiens (Human)
Description:
Q99572
Residue:
595
  
Inhibitor
Name:
BDBM50536370
Synonyms:
CHEMBL4582650
Type:
Small organic molecule
Emp. Form.:
C33H35N5O5S
Mol. Mass.:
613.727
SMILES:
CN(C)c1ccc(cc1)C(=O)N1CCC(CC1)n1cncc1-c1ccc(OS(=O)(=O)c2cccc(c2)C(=O)NC2CC2)cc1
: