Target
P2X purinoceptor 7
Ligand
BDBM50536405
Substrate
Meas. Tech.
ChEMBL_1933658 (CHEMBL4479310)
IC50
0.320000±n/a nM
Citation
 Park, JHWilliams, DRLee, JHLee, SDLee, JHKo, HLee, GEKim, SLee, JMAbdelrahman, AMüller, CEJung, DWKim, YC Potent Suppressive Effects of 1-Piperidinylimidazole Based Novel P2X7 Receptor Antagonists on Cancer Cell Migration and Invasion. J Med Chem 59:7410-30 (2016)  
Target
Name:
P2X purinoceptor 7
Synonyms:
ATP receptor P2RX7_HUMAN P2X purinoceptor 7 (P2X7) P2Z receptor | Purinergic receptor
Type:
Protein
Mol. Mass.:
68602.85
Organism:
Homo sapiens (Human)
Description:
Q99572
Residue:
595
  
Inhibitor
Name:
BDBM50536405
Synonyms:
CHEMBL4521847
Type:
Small organic molecule
Emp. Form.:
C31H28N4O6S2
Mol. Mass.:
616.707
SMILES:
CS(=O)(=O)c1ccc(cc1)C(=O)N1CCC(CC1)n1cncc1-c1ccc(OS(=O)(=O)c2cccc3cnccc23)cc1
: