Target
Ephrin type-A receptor 8
Ligand
BDBM50536678
Substrate
Meas. Tech.
ChEMBL_1934065 (CHEMBL4479717)
IC50
29±n/a nM
Citation
 Sloman, DLNoucti, NAltman, MDChen, DMislak, ACSzewczak, AHayashi, MWarren, LDellovade, TWu, ZMarcus, JWalker, DSu, HPEdavettal, SCMunshi, SHutton, MNuthall, HStanton, MG Optimization of microtubule affinity regulating kinase (MARK) inhibitors with improved physical properties. Bioorg Med Chem Lett 26:4362-6 (2016)  
Target
Name:
Ephrin type-A receptor 8
Synonyms:
EEK EPHA8_HUMAN Ephrin type-A receptor 8 KIAA1459
Type:
PROTEIN
Mol. Mass.:
111022.09
Organism:
Homo sapiens (Human)
Description:
ChEMBL_774600
Residue:
1005
  
Inhibitor
Name:
BDBM50536678
Synonyms:
CHEMBL4550702
Type:
Small organic molecule
Emp. Form.:
C17H13F3N6OS
Mol. Mass.:
406.385
SMILES:
Cn1cc(cn1)-c1cnc2c(cnn2c1)-c1csc(c1)C(=O)NCC(F)(F)F
: