Target
Ephrin type-A receptor 8
Ligand
BDBM50536675
Substrate
Meas. Tech.
ChEMBL_1934065 (CHEMBL4479717)
IC50
21±n/a nM
Citation
 Sloman, DLNoucti, NAltman, MDChen, DMislak, ACSzewczak, AHayashi, MWarren, LDellovade, TWu, ZMarcus, JWalker, DSu, HPEdavettal, SCMunshi, SHutton, MNuthall, HStanton, MG Optimization of microtubule affinity regulating kinase (MARK) inhibitors with improved physical properties. Bioorg Med Chem Lett 26:4362-6 (2016)  
Target
Name:
Ephrin type-A receptor 8
Synonyms:
EEK EPHA8_HUMAN Ephrin type-A receptor 8 KIAA1459
Type:
PROTEIN
Mol. Mass.:
111022.09
Organism:
Homo sapiens (Human)
Description:
ChEMBL_774600
Residue:
1005
  
Inhibitor
Name:
BDBM50536675
Synonyms:
CHEMBL4569508
Type:
Small organic molecule
Emp. Form.:
C26H26F3N5O2S
Mol. Mass.:
529.577
SMILES:
FC(F)(F)CNC(=O)c1cc(cs1)-c1cnn2cc(cnc12)-c1ccc(OCCN2CCCCC2)cc1
: