Target
Cholecystokinin receptor type A
Ligand
BDBM50092394
Substrate
Meas. Tech.
ChEMBL_49727 (CHEMBL661969)
Ki
18±n/a nM
Citation
 Bellier, BMillion, MEDaNascimento, SMeudal, HKellou, SMaigret, BGarbay, C Replacement of glycine with dicarbonyl and related moieties in analogues of the C-terminal pentapeptide of cholecystokinin: CCK(2) agonists displaying a novel binding mode. J Med Chem 43:3614-23 (2000)  
Target
Name:
Cholecystokinin receptor type A
Synonyms:
CCK-A receptor CCK1-R CCKAR_CAVPO Cholecystokinin receptor type A | Cholecystokinin-1 receptor
Type:
Mol. Mass.:
48229.77
Organism:
Cavia porcellus
Description:
Residue:
430
  
Inhibitor
Name:
BDBM50092394
Synonyms:
(S)-3-((S)-2-{[(S)-2-(2-Amino-acetylamino)-3-(S)-1H-indol-3-yl-propionyl]-methyl-amino}-hexanoylamino)-N-(1-carbamoyl-2-phenyl-ethyl)-succinamic acid CHEMBL59865
Type:
Small organic molecule
Emp. Form.:
C33H43N7O7
Mol. Mass.:
649.7372
SMILES:
CCCC[C@H](N(C)C(=O)[C@H](Cc1c[nH]c2ccccc12)NC(=O)CN)C(=O)N[C@@H](CC(O)=O)C(=O)N[C@@H](Cc1ccccc1)C(N)=O
: