Target
Histone-lysine N-methyltransferase, H3 lysine-79 specific
Ligand
BDBM50536826
Substrate
Meas. Tech.
ChEMBL_1934647 (CHEMBL4480299)
IC50
16±n/a nM
Citation
 Chen, CZhu, HStauffer, FCaravatti, GVollmer, SMachauer, RHolzer, PMöbitz, HScheufler, CKlumpp, MTiedt, RBeyer, KSCalkins, KGuthy, DKiffe, MZhang, JGaul, C Discovery of Novel Dot1L Inhibitors through a Structure-Based Fragmentation Approach. ACS Med Chem Lett 7:735-40 (2016)  
Target
Name:
Histone-lysine N-methyltransferase, H3 lysine-79 specific
Synonyms:
2.1.1.43 DOT1-like protein (Dot1L) DOT1L_HUMAN Histone H3-K79 methyltransferase Histone Methyltransferase DOT1L KIAA1814 Lysine N-methyltransferase 4
Type:
Protein
Mol. Mass.:
184911.91
Organism:
Homo sapiens (Human)
Description:
Q8TEK3
Residue:
1537
  
Inhibitor
Name:
BDBM50536826
Synonyms:
CHEMBL4590355
Type:
Small organic molecule
Emp. Form.:
C27H24N8O
Mol. Mass.:
476.5325
SMILES:
CNc1ccnc(Nc2ccc3cc(C)n(-c4ccccc4Oc4cnc5n(C)cnc5c4)c3c2)n1
: