Target
Cannabinoid receptor 2
Ligand
BDBM50380892
Substrate
Meas. Tech.
ChEMBL_1935004 (CHEMBL4480763)
Ki
36±n/a nM
Citation
 Leleu-Chavain, NBaudelet, DHeloire, VMRocha, DERenault, NBarczyk, ADjouina, MBody-Malapel, MCarato, PMillet, R Benzo[d]thiazol-2(3H)-ones as new potent selective CB Eur J Med Chem 165:347-362 (2019)  
Target
Name:
Cannabinoid receptor 2
Synonyms:
CANNABINOID CB2 CB2 CB2B CNR2_HUMAN Cannabinoid CB2 receptor Cannabinoid receptor 2 (CB2R) | hCB2
Type:
G Protein-Coupled Receptor (GPCR)
Mol. Mass.:
39690.94
Organism:
Homo sapiens (Human)
Description:
P34972
Residue:
360
  
Inhibitor
Name:
BDBM50380892
Synonyms:
CHEMBL2019090 | S-777469
Type:
Small organic molecule
Emp. Form.:
C23H27FN2O4
Mol. Mass.:
414.4699
SMILES:
CCc1c(C)cc(C(=O)NC2(CCCCC2)C(O)=O)c(=O)n1Cc1ccc(F)cc1
: