Target
Serine protease 1
Ligand
BDBM50093136
Substrate
Meas. Tech.
ChEBML_212894
Ki
146000±n/a nM
Citation
 Rice, KDGangloff, ARKuo, EYDener, JMWang, VRLum, RNewcomb, WSHavel, CPutnam, DCregar, LWong, MWarne, RL Dibasic inhibitors of human mast cell tryptase. Part 1: synthesis and optimization of a novel class of inhibitors. Bioorg Med Chem Lett 10:2357-60 (2001)  
Target
Name:
Serine protease 1
Synonyms:
Alpha-trypsin chain 1 Beta-trypsin PRSS1 TRP1 TRY1_HUMAN Thrombin & trypsin Trypsin I | Trypsin-1
Type:
Enzyme
Mol. Mass.:
26557.80
Organism:
Homo sapiens (Human)
Description:
P07477
Residue:
247
  
Inhibitor
Name:
BDBM50093136
Synonyms:
CHEMBL309788 | N-(4-Guanidino-benzyl)-N'-(4-{[3-(4-guanidino-benzylcarbamoyl)-propionylamino]-methyl}-benzyl)-succinamide
Type:
Small organic molecule
Emp. Form.:
C32H40N10O4
Mol. Mass.:
628.7246
SMILES:
[#7]\[#6](-[#7])=[#7]/c1ccc(-[#6]-[#7]-[#6](=O)-[#6]-[#6]-[#6](=O)-[#7]-[#6]-c2ccc(-[#6]-[#7]-[#6](=O)-[#6]-[#6]-[#6](=O)-[#7]-[#6]-c3ccc(cc3)\[#7]=[#6](/[#7])-[#7])cc2)cc1
: