Target
Serine protease 1
Ligand
BDBM50093138
Substrate
Meas. Tech.
ChEBML_212894
Ki
>1000000±n/a nM
Citation
 Rice, KDGangloff, ARKuo, EYDener, JMWang, VRLum, RNewcomb, WSHavel, CPutnam, DCregar, LWong, MWarne, RL Dibasic inhibitors of human mast cell tryptase. Part 1: synthesis and optimization of a novel class of inhibitors. Bioorg Med Chem Lett 10:2357-60 (2001)  
Target
Name:
Serine protease 1
Synonyms:
Alpha-trypsin chain 1 Beta-trypsin PRSS1 TRP1 TRY1_HUMAN Thrombin & trypsin Trypsin I | Trypsin-1
Type:
Enzyme
Mol. Mass.:
26557.80
Organism:
Homo sapiens (Human)
Description:
P07477
Residue:
247
  
Inhibitor
Name:
BDBM50093138
Synonyms:
CHEMBL78757 | N-(4-Aminomethyl-benzyl)-N'-[4-({3-[(4-aminomethyl-benzyl)-methyl-carbamoyl]-propionylamino}-methyl)-benzyl]-N-methyl-succinamide
Type:
Small organic molecule
Emp. Form.:
C34H44N6O4
Mol. Mass.:
600.751
SMILES:
CN(Cc1ccc(CN)cc1)C(=O)CCC(=O)NCc1ccc(CNC(=O)CCC(=O)N(C)Cc2ccc(CN)cc2)cc1
: