Target
Prothrombin
Ligand
BDBM50093140
Substrate
Meas. Tech.
ChEBML_208334
Ki
14000±n/a nM
Citation
 Rice, KDGangloff, ARKuo, EYDener, JMWang, VRLum, RNewcomb, WSHavel, CPutnam, DCregar, LWong, MWarne, RL Dibasic inhibitors of human mast cell tryptase. Part 1: synthesis and optimization of a novel class of inhibitors. Bioorg Med Chem Lett 10:2357-60 (2001)  
Target
Name:
Prothrombin
Synonyms:
Activation peptide fragment 1 Coagulation factor II Prothrombin precursor Thrombin heavy chain | Thrombin light chain
Type:
Protein
Mol. Mass.:
70029.57
Organism:
Homo sapiens (Human)
Description:
P00734
Residue:
622
  
Inhibitor
Name:
BDBM50093140
Synonyms:
CHEMBL43463 | Derivative of piperazine-1-carboxylic acid 5-(piperazine-1-carbonyloxy)-cyclooctyl ester
Type:
Small organic molecule
Emp. Form.:
C34H46N6O6
Mol. Mass.:
634.7656
SMILES:
O=C(NCc1ccccc1)N1CCN(CC1)C(=O)O[C@H]1CCC[C@H](CCC1)OC(=O)N1CCN(CC1)C(=O)NCc1ccccc1
: