Target
Plasminogen
Ligand
BDBM50093143
Substrate
Meas. Tech.
ChEBML_155238
Ki
769000.0±n/a nM
Citation
 Rice, KDGangloff, ARKuo, EYDener, JMWang, VRLum, RNewcomb, WSHavel, CPutnam, DCregar, LWong, MWarne, RL Dibasic inhibitors of human mast cell tryptase. Part 1: synthesis and optimization of a novel class of inhibitors. Bioorg Med Chem Lett 10:2357-60 (2001)  
Target
Name:
Plasminogen
Synonyms:
Activation peptide PLG Plasmin Plasmin heavy chain A, short form | Plasmin light chain B
Type:
Enzyme
Mol. Mass.:
90579.18
Organism:
Homo sapiens (Human)
Description:
Residue:
810
  
Inhibitor
Name:
BDBM50093143
Synonyms:
CHEMBL76733 | N-(4-Aminomethyl-benzyl)-N'-(4-{[3-(4-aminomethyl-benzylcarbamoyl)-propionylamino]-methyl}-benzyl)-succinamide
Type:
Small organic molecule
Emp. Form.:
C32H40N6O4
Mol. Mass.:
572.6978
SMILES:
NCc1ccc(CNC(=O)CCC(=O)NCc2ccc(CNC(=O)CCC(=O)NCc3ccc(CN)cc3)cc2)cc1
: