Target
Serine protease 1
Ligand
BDBM50093139
Substrate
Meas. Tech.
ChEBML_212894
Ki
38000±n/a nM
Citation
 Rice, KDGangloff, ARKuo, EYDener, JMWang, VRLum, RNewcomb, WSHavel, CPutnam, DCregar, LWong, MWarne, RL Dibasic inhibitors of human mast cell tryptase. Part 1: synthesis and optimization of a novel class of inhibitors. Bioorg Med Chem Lett 10:2357-60 (2001)  
Target
Name:
Serine protease 1
Synonyms:
Alpha-trypsin chain 1 Beta-trypsin PRSS1 TRP1 TRY1_HUMAN Thrombin & trypsin Trypsin I | Trypsin-1
Type:
Enzyme
Mol. Mass.:
26557.80
Organism:
Homo sapiens (Human)
Description:
P07477
Residue:
247
  
Inhibitor
Name:
BDBM50093139
Synonyms:
CHEMBL310289 | [(R)-1-(4-Aminomethyl-benzylcarbamoyl)-ethyl]-carbamic acid 4-[(R)-1-(4-aminomethyl-benzylcarbamoyl)-ethylcarbamoyloxymethyl]-benzyl ester
Type:
Small organic molecule
Emp. Form.:
C32H40N6O6
Mol. Mass.:
604.6966
SMILES:
C[C@@H](NC(=O)OCc1ccc(COC(=O)N[C@H](C)C(=O)NCc2ccc(CN)cc2)cc1)C(=O)NCc1ccc(CN)cc1
: