Target
Plasminogen
Ligand
BDBM50093142
Substrate
Meas. Tech.
ChEBML_155238
Ki
494000.0±n/a nM
Citation
 Rice, KDGangloff, ARKuo, EYDener, JMWang, VRLum, RNewcomb, WSHavel, CPutnam, DCregar, LWong, MWarne, RL Dibasic inhibitors of human mast cell tryptase. Part 1: synthesis and optimization of a novel class of inhibitors. Bioorg Med Chem Lett 10:2357-60 (2001)  
Target
Name:
Plasminogen
Synonyms:
Activation peptide PLG Plasmin Plasmin heavy chain A, short form | Plasmin light chain B
Type:
Enzyme
Mol. Mass.:
90579.18
Organism:
Homo sapiens (Human)
Description:
Residue:
810
  
Inhibitor
Name:
BDBM50093142
Synonyms:
1,5-di{4-[4-amino(imino)methylaminobenzylcarbamoyl]hexahydro-1-pyrazinylcarbonyloxy}cyclooctane APC-1390 Derivative of piperazine-1-carboxylic acid 5-(piperazine-1-carbonyloxy)-cyclooctyl ester
Type:
Small organic molecule
Emp. Form.:
C36H52N12O6
Mol. Mass.:
748.8749
SMILES:
[#7]\[#6](-[#7])=[#7]/c1ccc(-[#6]-[#7]-[#6](=O)-[#7]-2-[#6]-[#6]-[#7](-[#6]-[#6]-2)-[#6](=O)-[#8]-[#6@H]-2-[#6]-[#6]-[#6]-[#6@H](-[#6]-[#6]-[#6]-2)-[#8]-[#6](=O)-[#7]-2-[#6]-[#6]-[#7](-[#6]-[#6]-2)-[#6](=O)-[#7]-[#6]-c2ccc(cc2)\[#7]=[#6](/[#7])-[#7])cc1
: