Target
Serine protease 1
Ligand
BDBM50093145
Substrate
Meas. Tech.
ChEBML_212894
Ki
72000±n/a nM
Citation
 Rice, KDGangloff, ARKuo, EYDener, JMWang, VRLum, RNewcomb, WSHavel, CPutnam, DCregar, LWong, MWarne, RL Dibasic inhibitors of human mast cell tryptase. Part 1: synthesis and optimization of a novel class of inhibitors. Bioorg Med Chem Lett 10:2357-60 (2001)  
Target
Name:
Serine protease 1
Synonyms:
Alpha-trypsin chain 1 Beta-trypsin PRSS1 TRP1 TRY1_HUMAN Thrombin & trypsin Trypsin I | Trypsin-1
Type:
Enzyme
Mol. Mass.:
26557.80
Organism:
Homo sapiens (Human)
Description:
P07477
Residue:
247
  
Inhibitor
Name:
BDBM50093145
Synonyms:
CHEMBL408300 | [2-(4-Guanidino-benzylcarbamoyl)-ethyl]-carbamic acid 4-[2-(4-guanidino-benzylcarbamoyl)-ethylcarbamoyloxymethyl]-benzyl ester
Type:
Small organic molecule
Emp. Form.:
C32H40N10O6
Mol. Mass.:
660.7234
SMILES:
[#7]\[#6](-[#7])=[#7]/c1ccc(-[#6]-[#7]-[#6](=O)-[#6]-[#6]-[#7]-[#6](=O)-[#8]-[#6]-c2ccc(-[#6]-[#8]-[#6](=O)-[#7]-[#6]-[#6]-[#6](=O)-[#7]-[#6]-c3ccc(cc3)\[#7]=[#6](/[#7])-[#7])cc2)cc1
: