Target
Serine protease 1
Ligand
BDBM50093132
Substrate
Meas. Tech.
ChEBML_212894
Ki
78000±n/a nM
Citation
 Rice, KDGangloff, ARKuo, EYDener, JMWang, VRLum, RNewcomb, WSHavel, CPutnam, DCregar, LWong, MWarne, RL Dibasic inhibitors of human mast cell tryptase. Part 1: synthesis and optimization of a novel class of inhibitors. Bioorg Med Chem Lett 10:2357-60 (2001)  
Target
Name:
Serine protease 1
Synonyms:
Alpha-trypsin chain 1 Beta-trypsin PRSS1 TRP1 TRY1_HUMAN Thrombin & trypsin Trypsin I | Trypsin-1
Type:
Enzyme
Mol. Mass.:
26557.80
Organism:
Homo sapiens (Human)
Description:
P07477
Residue:
247
  
Inhibitor
Name:
BDBM50093132
Synonyms:
CHEMBL75749 | [3-(4-Guanidino-benzyl)-ureido]-acetic acid 5-{2-[3-(4-guanidino-benzyl)-ureido]-acetoxy}-cyclooctyl ester
Type:
Small organic molecule
Emp. Form.:
C30H42N10O6
Mol. Mass.:
638.7179
SMILES:
[#7]\[#6](-[#7])=[#7]/c1ccc(-[#6]-[#7]-[#6](=O)-[#7]-[#6]-[#6](=O)-[#8]-[#6@H]-2-[#6]-[#6]-[#6]-[#6@H](-[#6]-[#6]-[#6]-2)-[#8]-[#6](=O)-[#6]-[#7]-[#6](=O)-[#7]-[#6]-c2ccc(cc2)\[#7]=[#6](\[#7])-[#7])cc1
: