Target
Tryptase beta-2
Ligand
BDBM50093145
Substrate
Meas. Tech.
ChEBML_210829
Ki
90±n/a nM
Citation
 Rice, KDGangloff, ARKuo, EYDener, JMWang, VRLum, RNewcomb, WSHavel, CPutnam, DCregar, LWong, MWarne, RL Dibasic inhibitors of human mast cell tryptase. Part 1: synthesis and optimization of a novel class of inhibitors. Bioorg Med Chem Lett 10:2357-60 (2001)  
Target
Name:
Tryptase beta-2
Synonyms:
TPS2 TRYB2_HUMAN Tryptase II Tryptase-2
Type:
PROTEIN
Mol. Mass.:
30518.79
Organism:
Homo sapiens (Human)
Description:
ChEMBL_210702
Residue:
275
  
Inhibitor
Name:
BDBM50093145
Synonyms:
CHEMBL408300 | [2-(4-Guanidino-benzylcarbamoyl)-ethyl]-carbamic acid 4-[2-(4-guanidino-benzylcarbamoyl)-ethylcarbamoyloxymethyl]-benzyl ester
Type:
Small organic molecule
Emp. Form.:
C32H40N10O6
Mol. Mass.:
660.7234
SMILES:
[#7]\[#6](-[#7])=[#7]/c1ccc(-[#6]-[#7]-[#6](=O)-[#6]-[#6]-[#7]-[#6](=O)-[#8]-[#6]-c2ccc(-[#6]-[#8]-[#6](=O)-[#7]-[#6]-[#6]-[#6](=O)-[#7]-[#6]-c3ccc(cc3)\[#7]=[#6](/[#7])-[#7])cc2)cc1
: