Target
Serine protease 1
Ligand
BDBM50084616
Substrate
Meas. Tech.
ChEBML_212894
Ki
84000±n/a nM
Citation
 Rice, KDGangloff, ARKuo, EYDener, JMWang, VRLum, RNewcomb, WSHavel, CPutnam, DCregar, LWong, MWarne, RL Dibasic inhibitors of human mast cell tryptase. Part 1: synthesis and optimization of a novel class of inhibitors. Bioorg Med Chem Lett 10:2357-60 (2001)  
Target
Name:
Serine protease 1
Synonyms:
Alpha-trypsin chain 1 Beta-trypsin PRSS1 TRP1 TRY1_HUMAN Thrombin & trypsin Trypsin I | Trypsin-1
Type:
Enzyme
Mol. Mass.:
26557.80
Organism:
Homo sapiens (Human)
Description:
P07477
Residue:
247
  
Inhibitor
Name:
BDBM50084616
Synonyms:
CHEMBL310290 | [(4-Aminomethyl-benzylcarbamoyl)-methyl]-carbamic acid 4-[(4-aminomethyl-benzylcarbamoyl)-methylcarbamoyloxymethyl]-benzyl ester
Type:
Small organic molecule
Emp. Form.:
C30H36N6O6
Mol. Mass.:
576.6434
SMILES:
NCc1ccc(CNC(=O)CNC(=O)OCc2ccc(COC(=O)NCC(=O)NCc3ccc(CN)cc3)cc2)cc1
: