Target
Plasminogen
Ligand
BDBM50093160
Substrate
Meas. Tech.
ChEBML_155239
Ki
>1000000±n/a nM
Citation
 Rice, KDWang, VRGangloff, ARKuo, EYDener, JMNewcomb, WSYoung, WBPutnam, DCregar, LWong, MSimpson, PJ Dibasic inhibitors of human mast cell tryptase. Part 2: structure-activity relationships and requirements for potent activity. Bioorg Med Chem Lett 10:2361-6 (2001)  
Target
Name:
Plasminogen
Synonyms:
Activation peptide PLG Plasmin Plasmin heavy chain A, short form | Plasmin light chain B
Type:
Enzyme
Mol. Mass.:
90579.18
Organism:
Homo sapiens (Human)
Description:
Residue:
810
  
Inhibitor
Name:
BDBM50093160
Synonyms:
CHEMBL263454 | Derivative of piperazine-1-carboxylic acid 5-(piperazine-1-carbonyloxy)-cyclooctyl ester
Type:
Small organic molecule
Emp. Form.:
C36H64N8O6
Mol. Mass.:
704.9434
SMILES:
NC[C@H]1CC[C@H](CNC(=O)N2CCN(CC2)C(=O)O[C@H]2CCC[C@H](CCC2)OC(=O)N2CCN(CC2)C(=O)NC[C@H]2CC[C@H](CN)CC2)CC1
: