Target
Tryptase beta-2/delta/gamma
Ligand
BDBM50093196
Substrate
Meas. Tech.
ChEMBL_210830 (CHEMBL811859)
Ki
10±n/a nM
Citation
 Rice, KDWang, VRGangloff, ARKuo, EYDener, JMNewcomb, WSYoung, WBPutnam, DCregar, LWong, MSimpson, PJ Dibasic inhibitors of human mast cell tryptase. Part 2: structure-activity relationships and requirements for potent activity. Bioorg Med Chem Lett 10:2361-6 (2001)  
Target
Name:
Tryptase beta-2/delta/gamma
Synonyms:
Tryptase
Type:
Mol. Mass.:
Description:
ASSAY_ID of ChEMBL is 1510505
Components:
This complex has 3 components.
Component 1
Name:
Tryptase gamma
Synonyms:
PRSS31 TMT TRYG1_HUMAN Tryptase Tryptase gamma heavy chain | Tryptase gamma light chain
Type:
PROTEIN
Mol. Mass.:
33817.52
Organism:
Homo sapiens (Human)
Description:
ChEMBL_210833
Residue:
321
  
Component 2
Name:
Tryptase beta-2
Synonyms:
TPS2 TRYB2_HUMAN Tryptase II Tryptase-2
Type:
PROTEIN
Mol. Mass.:
30518.79
Organism:
Homo sapiens (Human)
Description:
ChEMBL_210702
Residue:
275
  
Component 3
Name:
Tryptase delta
Synonyms:
Delta-tryptase Mast cell mMCP-7-like TRYD_HUMAN Tryptase-3
Type:
PROTEIN
Mol. Mass.:
26578.73
Organism:
Homo sapiens (Human)
Description:
ChEMBL_104777
Residue:
242
  
Inhibitor
Name:
BDBM50093196
Synonyms:
CHEMBL78283 | Derivative of piperazine-1-carboxylic acid 5-(piperazine-1-carbonyloxymethyl)-tricyclo[3.3.1.1*3,7*]decan-1-ylmethyl ester
Type:
Small organic molecule
Emp. Form.:
C40H56N12O6
Mol. Mass.:
800.9494
SMILES:
[#7]\[#6](-[#7])=[#7]/c1ccc(-[#6]-[#7]-[#6](=O)-[#7]-2-[#6]-[#6]-[#7](-[#6]-[#6]-2)-[#6](=O)-[#8]-[#6]C23[#6]-[#6]-4-[#6]-[#6](-[#6]2)-[#6]C([#6]-[#8]-[#6](=O)-[#7]-2-[#6]-[#6]-[#7](-[#6]-[#6]-2)-[#6](=O)-[#7]-[#6]-c2ccc(cc2)\[#7]=[#6](/[#7])-[#7])([#6]-4)[#6]3)cc1
: