Target
Tryptase beta-2/delta/gamma
Ligand
BDBM50093164
Substrate
Meas. Tech.
ChEMBL_210830 (CHEMBL811859)
Ki
3±n/a nM
Citation
 Rice, KDWang, VRGangloff, ARKuo, EYDener, JMNewcomb, WSYoung, WBPutnam, DCregar, LWong, MSimpson, PJ Dibasic inhibitors of human mast cell tryptase. Part 2: structure-activity relationships and requirements for potent activity. Bioorg Med Chem Lett 10:2361-6 (2001)  
Target
Name:
Tryptase beta-2/delta/gamma
Synonyms:
Tryptase
Type:
Mol. Mass.:
Description:
ASSAY_ID of ChEMBL is 1510505
Components:
This complex has 3 components.
Component 1
Name:
Tryptase gamma
Synonyms:
PRSS31 TMT TRYG1_HUMAN Tryptase Tryptase gamma heavy chain | Tryptase gamma light chain
Type:
PROTEIN
Mol. Mass.:
33817.52
Organism:
Homo sapiens (Human)
Description:
ChEMBL_210833
Residue:
321
  
Component 2
Name:
Tryptase beta-2
Synonyms:
TPS2 TRYB2_HUMAN Tryptase II Tryptase-2
Type:
PROTEIN
Mol. Mass.:
30518.79
Organism:
Homo sapiens (Human)
Description:
ChEMBL_210702
Residue:
275
  
Component 3
Name:
Tryptase delta
Synonyms:
Delta-tryptase Mast cell mMCP-7-like TRYD_HUMAN Tryptase-3
Type:
PROTEIN
Mol. Mass.:
26578.73
Organism:
Homo sapiens (Human)
Description:
ChEMBL_104777
Residue:
242
  
Inhibitor
Name:
BDBM50093164
Synonyms:
CHEMBL308632 | Derivative of APC-2059
Type:
Small organic molecule
Emp. Form.:
C36H52N12O6
Mol. Mass.:
748.8749
SMILES:
NC(N)=Nc1ccc(CNC(=O)N2CCN(CC2)C(=O)OC[C@H]2CC[C@H](COC(=O)N3CCN(CC3)C(=O)NCc3ccc(cc3)N=C(N)N)CC2)cc1
: