Target
Homeodomain-interacting protein kinase 3
Ligand
BDBM50537742
Substrate
Meas. Tech.
ChEBML_1970680
IC50
>100000±n/a nM
Citation
 Zhou, HMcGowan, MALipford, KChristopher, MFradera, XWitter, DLesburg, CALi, CMethot, JLLampe, JAchab, AShaffer, LGoldenblatt, PShah, SBass, ASchroeder, GChen, DZeng, HAugustin, MAKatz, JD Discovery and optimization of heteroaryl piperazines as potent and selective PI3K? inhibitors. Bioorg Med Chem Lett 30:0 (2020)  
Target
Name:
Homeodomain-interacting protein kinase 3
Synonyms:
DYRK6 HIPK3 PKY
Type:
PROTEIN
Mol. Mass.:
133763.81
Organism:
Homo sapiens (Human)
Description:
ChEMBL_774503
Residue:
1215
  
Inhibitor
Name:
BDBM50537742
Synonyms:
CHEMBL4634634 | US11179389, Compound 1-14
Type:
Small organic molecule
Emp. Form.:
C19H23N7O
Mol. Mass.:
365.4322
SMILES:
C[C@@H]1C[C@H]1C(=O)N1CCN(C[C@H]1C)c1cnc(C#N)c(n1)-c1cnn(C)c1
: