Target
Serine/threonine-protein kinase Sgk2
Ligand
BDBM50537742
Substrate
Meas. Tech.
ChEBML_1970803
IC50
>100000±n/a nM
Citation
 Zhou, HMcGowan, MALipford, KChristopher, MFradera, XWitter, DLesburg, CALi, CMethot, JLLampe, JAchab, AShaffer, LGoldenblatt, PShah, SBass, ASchroeder, GChen, DZeng, HAugustin, MAKatz, JD Discovery and optimization of heteroaryl piperazines as potent and selective PI3K? inhibitors. Bioorg Med Chem Lett 30:0 (2020)  
Target
Name:
Serine/threonine-protein kinase Sgk2
Synonyms:
SGK2 Serum/glucocorticoid-regulated kinase 2
Type:
PROTEIN
Mol. Mass.:
41175.85
Organism:
Homo sapiens
Description:
ChEMBL_101557
Residue:
367
  
Inhibitor
Name:
BDBM50537742
Synonyms:
CHEMBL4634634 | US11179389, Compound 1-14
Type:
Small organic molecule
Emp. Form.:
C19H23N7O
Mol. Mass.:
365.4322
SMILES:
C[C@@H]1C[C@H]1C(=O)N1CCN(C[C@H]1C)c1cnc(C#N)c(n1)-c1cnn(C)c1
: