Target
Tyrosine-protein kinase receptor Tie-1
Ligand
BDBM50538507
Substrate
Meas. Tech.
ChEMBL_1973001 (CHEMBL4605819)
IC50
>11000±n/a nM
Citation
 Mathison, CJNChianelli, DRucker, PVNelson, JRoland, JHuang, ZYang, YJiang, JXie, YFEpple, RBursulaya, BLee, CGao, MYShaffer, JBriones, SSarkisova, YGalkin, ALi, LLi, NLi, CHua, SKasibhatla, SKinyamu-Akunda, JKikkawa, RMolteni, VTellew, JE Efficacy and Tolerability of Pyrazolo[1,5- ACS Med Chem Lett 11:558-565 (2020)  
Target
Name:
Tyrosine-protein kinase receptor Tie-1
Synonyms:
TIE TIE1_HUMAN
Type:
PROTEIN
Mol. Mass.:
125096.89
Organism:
Homo sapiens (Human)
Description:
ChEMBL_1498731
Residue:
1138
  
Inhibitor
Name:
BDBM50538507
Synonyms:
CHEMBL4640601
Type:
Small organic molecule
Emp. Form.:
C26H29N5O3
Mol. Mass.:
459.5402
SMILES:
COc1ccc(cc1OC)-c1cnn2c(N)c(-c3ccccc3)c(OC3CCN(C)CC3)nc12
: