Target
Ubiquitin carboxyl-terminal hydrolase 7
Ligand
BDBM50538556
Substrate
Meas. Tech.
ChEMBL_1973133 (CHEMBL4605951)
IC50
9.0±n/a nM
Citation
 Leger, PRHu, DXBiannic, BBui, MHan, XKarbarz, EMaung, JOkano, AOsipov, MShibuya, GMYoung, KHiggs, CAbraham, BBradford, DCho, CColas, CJacobson, SOhol, YMPookot, DRana, PSanchez, JShah, NSun, MWong, SBrockstedt, DGKassner, PDSchwarz, JBWustrow, DJ Discovery of Potent, Selective, and Orally Bioavailable Inhibitors of USP7 with In Vivo Antitumor Activity. J Med Chem 63:5398-5420 (2020)  
Target
Name:
Ubiquitin carboxyl-terminal hydrolase 7
Synonyms:
Deubiquitinating enzyme 7 Herpesvirus-associated ubiquitin-specific protease USP7 Ubiquitin-specific-processing protease 7
Type:
PROTEIN
Mol. Mass.:
128274.45
Organism:
Homo sapiens (Human)
Description:
ChEMBL_1469483
Residue:
1102
  
Inhibitor
Name:
BDBM50538556
Synonyms:
CHEMBL4646914
Type:
Small organic molecule
Emp. Form.:
C23H23Cl2N3O4S
Mol. Mass.:
508.417
SMILES:
OCC(O)(CCl)c1cc2nccc(-c3cc(Cl)cc4C[C@@H](Oc34)C(=O)N3CCNCC3)c2s1
: