Target
Ubiquitin carboxyl-terminal hydrolase 7
Ligand
BDBM50538568
Substrate
Meas. Tech.
ChEMBL_1973133 (CHEMBL4605951)
IC50
3.4±n/a nM
Citation
 Leger, PRHu, DXBiannic, BBui, MHan, XKarbarz, EMaung, JOkano, AOsipov, MShibuya, GMYoung, KHiggs, CAbraham, BBradford, DCho, CColas, CJacobson, SOhol, YMPookot, DRana, PSanchez, JShah, NSun, MWong, SBrockstedt, DGKassner, PDSchwarz, JBWustrow, DJ Discovery of Potent, Selective, and Orally Bioavailable Inhibitors of USP7 with In Vivo Antitumor Activity. J Med Chem 63:5398-5420 (2020)  
Target
Name:
Ubiquitin carboxyl-terminal hydrolase 7
Synonyms:
Deubiquitinating enzyme 7 Herpesvirus-associated ubiquitin-specific protease USP7 Ubiquitin-specific-processing protease 7
Type:
PROTEIN
Mol. Mass.:
128274.45
Organism:
Homo sapiens (Human)
Description:
ChEMBL_1469483
Residue:
1102
  
Inhibitor
Name:
BDBM50538568
Synonyms:
CHEMBL4640563
Type:
Small organic molecule
Emp. Form.:
C23H22ClN3O3S
Mol. Mass.:
455.957
SMILES:
Cc1cc(Cl)cc(c1O[C@H]1C[C@H](N)C1)-c1ccnc2cc(CN3C(=O)CCC3=O)sc12
: