Target
Ubiquitin carboxyl-terminal hydrolase 7
Ligand
BDBM50538572
Substrate
Meas. Tech.
ChEMBL_1973133 (CHEMBL4605951)
IC50
0.260000±n/a nM
Citation
 Leger, PRHu, DXBiannic, BBui, MHan, XKarbarz, EMaung, JOkano, AOsipov, MShibuya, GMYoung, KHiggs, CAbraham, BBradford, DCho, CColas, CJacobson, SOhol, YMPookot, DRana, PSanchez, JShah, NSun, MWong, SBrockstedt, DGKassner, PDSchwarz, JBWustrow, DJ Discovery of Potent, Selective, and Orally Bioavailable Inhibitors of USP7 with In Vivo Antitumor Activity. J Med Chem 63:5398-5420 (2020)  
Target
Name:
Ubiquitin carboxyl-terminal hydrolase 7
Synonyms:
Deubiquitinating enzyme 7 Herpesvirus-associated ubiquitin-specific protease USP7 Ubiquitin-specific-processing protease 7
Type:
PROTEIN
Mol. Mass.:
128274.45
Organism:
Homo sapiens (Human)
Description:
ChEMBL_1469483
Residue:
1102
  
Inhibitor
Name:
BDBM50538572
Synonyms:
CHEMBL4649132
Type:
Small organic molecule
Emp. Form.:
C27H26ClF3N4O3S
Mol. Mass.:
579.034
SMILES:
C[C@H]1CNCC[C@H]1Oc1c(C)cc(Cl)cc1-c1ccnc2cc(Cn3c(=O)ccn(CC(F)(F)F)c3=O)sc12
: