Target
Ubiquitin carboxyl-terminal hydrolase 7
Ligand
BDBM50538582
Substrate
Meas. Tech.
ChEMBL_1973133 (CHEMBL4605951)
IC50
0.780000±n/a nM
Citation
 Leger, PRHu, DXBiannic, BBui, MHan, XKarbarz, EMaung, JOkano, AOsipov, MShibuya, GMYoung, KHiggs, CAbraham, BBradford, DCho, CColas, CJacobson, SOhol, YMPookot, DRana, PSanchez, JShah, NSun, MWong, SBrockstedt, DGKassner, PDSchwarz, JBWustrow, DJ Discovery of Potent, Selective, and Orally Bioavailable Inhibitors of USP7 with In Vivo Antitumor Activity. J Med Chem 63:5398-5420 (2020)  
Target
Name:
Ubiquitin carboxyl-terminal hydrolase 7
Synonyms:
Deubiquitinating enzyme 7 Herpesvirus-associated ubiquitin-specific protease USP7 Ubiquitin-specific-processing protease 7
Type:
PROTEIN
Mol. Mass.:
128274.45
Organism:
Homo sapiens (Human)
Description:
ChEMBL_1469483
Residue:
1102
  
Inhibitor
Name:
BDBM50538582
Synonyms:
CHEMBL4638998
Type:
Small organic molecule
Emp. Form.:
C27H29ClN4O2S
Mol. Mass.:
509.063
SMILES:
Cc1cc(Cl)cc(c1NC1CCCNC1)-c1ccnc2cc(CN3C(=O)C4C(C3=O)C4(C)C)sc12
: