Target
Adenosine receptor A1
Ligand
BDBM50094684
Substrate
Meas. Tech.
ChEMBL_28052 (CHEMBL643045)
Ki
348±n/a nM
Citation
 Baraldi, PGCacciari, BRomagnoli, RSpalluto, GMoro, SKlotz, KNLeung, EVarani, KGessi, SMerighi, SBorea, PA Pyrazolo[4,3-e]1,2,4-triazolo[1,5-c]pyrimidine derivatives as highly potent and selective human A(3) adenosine receptor antagonists: influence of the chain at the N(8) pyrazole nitrogen. J Med Chem 43:4768-80 (2000)  
Target
Name:
Adenosine receptor A1
Synonyms:
A1 adenosine receptor (hA1) AA1R_HUMAN ADORA1 Adenosine A1-receptor Adenosine receptor A1 (hA1) | Adenosine transporter (AdT)
Type:
G Protein-Coupled Receptor (GPCR)
Mol. Mass.:
36520.92
Organism:
Homo sapiens (Human)
Description:
P30542
Residue:
326
  
Inhibitor
Name:
BDBM50094684
Synonyms:
2-Furan-2-yl-8-(2-naphthalen-1-yl-ethyl)-8H-pyrazolo[4,3-e][1,2,4]triazolo[1,5-c]pyrimidin-5-ylamine | CHEMBL146658
Type:
Small organic molecule
Emp. Form.:
C22H17N7O
Mol. Mass.:
395.4167
SMILES:
Nc1nc2nn(CCc3cccc4ccccc34)cc2c2nc(nn12)-c1ccco1
: