Target
Adenosine receptor A2b
Ligand
BDBM50082426
Substrate
Meas. Tech.
ChEMBL_31244 (CHEMBL642209)
Ki
90±n/a nM
Citation
 Baraldi, PGCacciari, BRomagnoli, RSpalluto, GMoro, SKlotz, KNLeung, EVarani, KGessi, SMerighi, SBorea, PA Pyrazolo[4,3-e]1,2,4-triazolo[1,5-c]pyrimidine derivatives as highly potent and selective human A(3) adenosine receptor antagonists: influence of the chain at the N(8) pyrazole nitrogen. J Med Chem 43:4768-80 (2000)  
Target
Name:
Adenosine receptor A2b
Synonyms:
AA2BR_HUMAN ADORA2B Adenosine receptors A2b | Adenosine receptors; A2a & A2b
Type:
G Protein-Coupled Receptor (GPCR)
Mol. Mass.:
36341.22
Organism:
Homo sapiens (Human)
Description:
Residue:
332
  
Inhibitor
Name:
BDBM50082426
Synonyms:
1-(3-Chloro-phenyl)-3-(2-furan-2-yl-8-phenethyl-8H-pyrazolo[4,3-e][1,2,4]triazolo[1,5-c]pyrimidin-5-yl)-urea CHEMBL137950
Type:
Small organic molecule
Emp. Form.:
C25H19ClN8O2
Mol. Mass.:
498.924
SMILES:
Clc1cccc(NC(=O)Nc2nc3nn(CCc4ccccc4)cc3c3nc(nn23)-c2ccco2)c1
: