Target
E3 SUMO-protein ligase CBX4
Ligand
BDBM50538813
Substrate
Meas. Tech.
ChEMBL_1977187 (CHEMBL4610322)
Kd
11300±n/a nM
Citation
 Milosevich, NMcFarlane, JGignac, MCLi, JBrown, TMWilson, CRDevorkin, LCroft, CSHof, RPaci, ILum, JJHof, F Pan-specific and partially selective dye-labeled peptidic inhibitors of the polycomb paralog proteins. Bioorg Med Chem 28:0 (2020)  
Target
Name:
E3 SUMO-protein ligase CBX4
Synonyms:
6.3.2.- CBX4_HUMAN Pc2 hPc2
Type:
PROTEIN
Mol. Mass.:
61401.05
Organism:
Homo sapiens (Human)
Description:
ChEMBL_108273
Residue:
560
  
Inhibitor
Name:
BDBM50538813
Synonyms:
CHEMBL4643012
Type:
Small organic molecule
Emp. Form.:
C75H95N12O17S
Mol. Mass.:
1468.691
SMILES:
CC[C@H](NC(=O)[C@H](Cc1ccccc1)NC(=O)[C@H](Cc1ccccc1)NC(C)=O)C(=O)N[C@@H](C1CCCC1)C(=O)N[C@@H](CCCC[N+](C)(C)C)C(=O)N[C@@H](CO)C(=O)N[C@@H](CCC(O)=O)C(=O)N[C@@H](CCCCNC(=S)Nc1ccc(c(c1)C(O)=O)-c1c2ccc(O)cc2oc2cc(=O)ccc12)C(N)=O
: