Target
Chromobox protein homolog 7
Ligand
BDBM50157430
Substrate
Meas. Tech.
ChEMBL_1977192 (CHEMBL4610327)
IC50
2300±n/a nM
Citation
 Milosevich, NMcFarlane, JGignac, MCLi, JBrown, TMWilson, CRDevorkin, LCroft, CSHof, RPaci, ILum, JJHof, F Pan-specific and partially selective dye-labeled peptidic inhibitors of the polycomb paralog proteins. Bioorg Med Chem 28:0 (2020)  
Target
Name:
Chromobox protein homolog 7
Synonyms:
CBX7 Chromobox protein homolog 7 | Chromobox protein homolog 7 (CBX7)
Type:
Protein
Mol. Mass.:
28351.76
Organism:
Homo sapiens (Human)
Description:
Residue:
251
  
Inhibitor
Name:
BDBM50157430
Synonyms:
CHEMBL3781271
Type:
Small organic molecule
Emp. Form.:
C40H53BrN7O8
Mol. Mass.:
839.794
SMILES:
C[C@H](NC(=O)[C@H](Cc1ccccc1)NC(=O)c1ccc(Br)cc1)C(=O)N[C@@H](Cc1ccc(O)cc1)C(=O)N[C@@H](CCCC[N+](C)(C)C)C(=O)N[C@@H](CO)C(N)=O
: