Target
Chromobox protein homolog 7
Ligand
BDBM50538817
Substrate
Meas. Tech.
ChEMBL_1977192 (CHEMBL4610327)
IC50
8300±n/a nM
Citation
 Milosevich, NMcFarlane, JGignac, MCLi, JBrown, TMWilson, CRDevorkin, LCroft, CSHof, RPaci, ILum, JJHof, F Pan-specific and partially selective dye-labeled peptidic inhibitors of the polycomb paralog proteins. Bioorg Med Chem 28:0 (2020)  
Target
Name:
Chromobox protein homolog 7
Synonyms:
CBX7 Chromobox protein homolog 7 | Chromobox protein homolog 7 (CBX7)
Type:
Protein
Mol. Mass.:
28351.76
Organism:
Homo sapiens (Human)
Description:
Residue:
251
  
Inhibitor
Name:
BDBM50538817
Synonyms:
CHEMBL4646032
Type:
Small organic molecule
Emp. Form.:
C44H64BrN8O10
Mol. Mass.:
944.93
SMILES:
CC[C@H](NC(=O)[C@H](Cc1ccccc1)NC(=O)c1ccc(Br)cc1)C(=O)N[C@@H](C1CCCC1)C(=O)N[C@@H](CCCC[N+](C)(C)C)C(=O)N[C@@H](CO)C(=O)N[C@@H](CCC(O)=O)C(N)=O
: