Target
N-acylethanolamine-hydrolyzing acid amidase
Ligand
BDBM393380
Substrate
Meas. Tech.
ChEMBL_1977317 (CHEMBL4610452)
IC50
1.1±n/a nM
Citation
 Malamas, MSFarah, SILamani, MPelekoudas, DNPerry, NTRajarshi, GMiyabe, CYChandrashekhar, HWest, JPavlopoulos, SMakriyannis, A Design and synthesis of cyanamides as potent and selective N-acylethanolamine acid amidase inhibitors. Bioorg Med Chem 28:0 (2020)  
Target
Name:
N-acylethanolamine-hydrolyzing acid amidase
Synonyms:
ASAH-like protein Acid ceramidase-like protein N-acylsphingosine amidohydrolase-like NAAA PLT
Type:
Enzyme
Mol. Mass.:
40073.12
Organism:
Homo sapiens (Human)
Description:
Q02083
Residue:
359
  
Inhibitor
Name:
BDBM393380
Synonyms:
3-((4-Phenoxybenzyl)oxy)azetidine-1-carbonitrile | US9963444, Example 81
Type:
Small organic molecule
Emp. Form.:
C17H16N2O2
Mol. Mass.:
280.3211
SMILES:
N#CN1CC(C1)OCc1ccc(Oc2ccccc2)cc1
: