Target
N-acylethanolamine-hydrolyzing acid amidase
Ligand
BDBM393391
Substrate
Meas. Tech.
ChEMBL_1977317 (CHEMBL4610452)
IC50
2.5±n/a nM
Citation
 Malamas, MSFarah, SILamani, MPelekoudas, DNPerry, NTRajarshi, GMiyabe, CYChandrashekhar, HWest, JPavlopoulos, SMakriyannis, A Design and synthesis of cyanamides as potent and selective N-acylethanolamine acid amidase inhibitors. Bioorg Med Chem 28:0 (2020)  
Target
Name:
N-acylethanolamine-hydrolyzing acid amidase
Synonyms:
ASAH-like protein Acid ceramidase-like protein N-acylsphingosine amidohydrolase-like NAAA PLT
Type:
Enzyme
Mol. Mass.:
40073.12
Organism:
Homo sapiens (Human)
Description:
Q02083
Residue:
359
  
Inhibitor
Name:
BDBM393391
Synonyms:
3-((4'-Cyano-5-phenoxy-[1,1'-biphenyl]-2-yl)methoxy)azetidine-1-carbonitrile | US9963444, Example 92
Type:
Small organic molecule
Emp. Form.:
C24H19N3O2
Mol. Mass.:
381.4266
SMILES:
N#CN1CC(C1)OCc1ccc(Oc2ccccc2)cc1-c1ccc(cc1)C#N
: