Target
N-acylethanolamine-hydrolyzing acid amidase
Ligand
BDBM50538922
Substrate
Meas. Tech.
ChEMBL_1977333 (CHEMBL4610468)
IC50
6.0±n/a nM
Citation
 Malamas, MSFarah, SILamani, MPelekoudas, DNPerry, NTRajarshi, GMiyabe, CYChandrashekhar, HWest, JPavlopoulos, SMakriyannis, A Design and synthesis of cyanamides as potent and selective N-acylethanolamine acid amidase inhibitors. Bioorg Med Chem 28:0 (2020)  
Target
Name:
N-acylethanolamine-hydrolyzing acid amidase
Synonyms:
ASAH-like protein Acid ceramidase-like protein N-acylsphingosine amidohydrolase-like NAAA PLT
Type:
Enzyme
Mol. Mass.:
40073.12
Organism:
Homo sapiens (Human)
Description:
Q02083
Residue:
359
  
Inhibitor
Name:
BDBM50538922
Synonyms:
CHEMBL4647961
Type:
Small organic molecule
Emp. Form.:
C22H32N2O5S
Mol. Mass.:
436.565
SMILES:
C[C@H]1[C@H](NC(=O)OCCCCC2CCCCC2)C(=O)N1c1cccc(c1)S(C)(=O)=O
: