Target
Glycogen phosphorylase, liver form
Ligand
BDBM50437355
Substrate
Meas. Tech.
ChEMBL_1977444 (CHEMBL4610579)
Ki
1350±n/a nM
Citation
 Kyriakis, EKarra, AGPapaioannou, OSolovou, TSkamnaki, VTLiggri, PGVZographos, SESzennyes, EBokor, ÉKun, SPsarra, AGSomsák, LLeonidas, DD The architecture of hydrogen and sulfur ?-hole interactions explain differences in the inhibitory potency of C-?-d-glucopyranosyl thiazoles, imidazoles and an N-?-d glucopyranosyl tetrazole for human liver glycogen phosphorylase and offer new insights to structure-based design. Bioorg Med Chem 28:0 (2020)  
Target
Name:
Glycogen phosphorylase, liver form
Synonyms:
Glycogen Phosphorylase (PYGL) Liver glycogen phosphorylase PYGL_HUMAN
Type:
Homodimer
Mol. Mass.:
97153.98
Organism:
Homo sapiens (Human)
Description:
Dimers associate into a tetramer to form the enzymatically active phosphorylase A.
Residue:
847
  
Inhibitor
Name:
BDBM50437355
Synonyms:
CHEMBL2408224
Type:
Small organic molecule
Emp. Form.:
C14H17N3O5
Mol. Mass.:
307.3019
SMILES:
OC[C@H]1O[C@H]([C@H](O)[C@@H](O)[C@@H]1O)c1nnc([nH]1)-c1ccccc1
: