Target
Lysine-specific demethylase 4C
Ligand
BDBM50538950
Substrate
Meas. Tech.
ChEMBL_1977466 (CHEMBL4610601)
IC50
42±n/a nM
Citation
 Letfus, VJeli?, DBokuli?, APetrini? Grba, AKo?trun, S Rational design, synthesis and biological profiling of new KDM4C inhibitors. Bioorg Med Chem 28:0 (2020)  
Target
Name:
Lysine-specific demethylase 4C
Synonyms:
GASC-1 protein Gene amplified in squamous cell carcinoma 1 protein JMJD2C Jumonji domain-containing protein 2C KDM4C_HUMAN | KIAA0780
Type:
Protein
Mol. Mass.:
119979.01
Organism:
Homo sapiens (Human)
Description:
Q9H3R0
Residue:
1056
  
Inhibitor
Name:
BDBM50538950
Synonyms:
CHEMBL4640696
Type:
Small organic molecule
Emp. Form.:
C13H12N6O4S
Mol. Mass.:
348.337
SMILES:
Cn1nc(nc2c1nc(=O)n(C)c2=O)-c1ccc(cc1)S(N)(=O)=O
: