Target
D(2) dopamine receptor
Ligand
BDBM50095027
Substrate
Meas. Tech.
ChEBML_60047
Ki
1300±n/a nM
Citation
 Smith, ALStevenson, GILewis, SPatel, SCastro, JL Solid-phase synthesis of 2,3-disubstituted indoles: discovery of a novel, high-affinity, selective h5-HT2A antagonist. Bioorg Med Chem Lett 10:2693-6 (2000)  
Target
Name:
D(2) dopamine receptor
Synonyms:
D(2) dopamine receptor DOPAMINE D2 Long DRD2 Dopamine D2 receptor Dopamine D2 receptor (D2R) Dopamine2-like | d2
Type:
Cell-surface receptors
Mol. Mass.:
50647.10
Organism:
Homo sapiens (Human)
Description:
P14416
Residue:
443
  
Inhibitor
Name:
BDBM50095027
Synonyms:
(2,3-Dimethoxy-phenyl)-{1-[2-(4-fluoro-phenyl)-ethyl]-piperidin-4-yl}-methanol (2,3-Dimethoxy-phenyl)-{1-[2-(4-fluoro-phenyl)-ethyl]-piperidin-4-yl}-methanol(MDL 100907) (R)-(2,3-Dimethoxy-phenyl)-{1-[2-(4-fluoro-phenyl)-ethyl]-piperidin-4-yl}-methanol (R)-(2,3-dimethoxyphenyl)(1-(4-fluorophenethyl)piperidin-4-yl)methanol MDL 100907 | MDL-100907
Type:
Small organic molecule
Emp. Form.:
C22H28FNO3
Mol. Mass.:
373.461
SMILES:
COc1cccc([C@H](O)C2CCN(CCc3ccc(F)cc3)CC2)c1OC
: