Target
Muscarinic acetylcholine receptor M2
Ligand
BDBM50095100
Substrate
Meas. Tech.
ChEBML_140175
Ki
35±n/a nM
Citation
 Boyle, CDChackalamannil, SChen, LYDugar, SPushpavanam, PBillard, WBinch, HCrosby, GCohen-Williams, MCoffin, VLDuffy, RARuperto, VLachowicz, JE Benzylidene ketal derivatives as M2 muscarinic receptor antagonists. Bioorg Med Chem Lett 10:2727-30 (2000)  
Target
Name:
Muscarinic acetylcholine receptor M2
Synonyms:
ACM2_HUMAN Cholinergic, muscarinic M2 Muscarinic acetylcholine receptor M2 and M5 | RecName: Full=Muscarinic acetylcholine receptor M2
Type:
GPCR
Mol. Mass.:
51730.61
Organism:
Homo sapiens (Human)
Description:
P08172
Residue:
466
  
Inhibitor
Name:
BDBM50095100
Synonyms:
CHEMBL328659 | [4-(Benzo[1,3]dioxole-5-sulfinyl)-phenyl]-[1'-(propane-1-sulfonyl)-[1,4']bipiperidinyl-4-yl]-methanone
Type:
Small organic molecule
Emp. Form.:
C27H34N2O6S2
Mol. Mass.:
546.699
SMILES:
CCCS(=O)(=O)N1CCC(CC1)N1CCC(CC1)C(=O)c1ccc(cc1)S(=O)c1ccc2OCOc2c1
: